{"text_format":"1","workbook":"xlsx","n_sheets":12,"sheets":["Mapa","Dane","Przykład","Przykładowe kody","Dane_","Kody","Kody_Dane","GUS","_MP_dane_","Ster","Paleta","Przedstawiciele"],"not_rendered":{"charts":1,"images":0,"macros":1,"external_links":1,"defined_names":415,"comments":0,"pivot_tables":0},"unopened":[],"bounds":{"document_bytes":16777216,"sheet_cells":100000,"rows_first":2000,"rows_last":500,"rows_between":2000,"halvings":0,"cell_chars":16384,"cell_head_chars":4096},"cells_cut":0,"cells_raw":0,"read":"whole","date_system":"1900"}

{"sheet":"Mapa","index":0,"n_rows":24,"n_cols":16,"rows_kept":24,"cut":false,"hidden":false,"merged":[[20,10,20,13]]}
[]
[null,null,null,null,null,null,null,null,null,null,null,null,null,null,null,"Szybkie demo"]
[null,null,null,null,null,null,null,null,null,null,null,null,null,null,null,"Kartogram"]
[null,null,null,null,null,null,null,null,null,null,null,null,null,null,null,"1. Wprowadź wartości w kolumnie G arkusza Dane (możesz je skopiować z arkusza Przykład)."]
[null,null,null,null,null,null,null,null,null,null,null,null,null,null,null,"2. Wybierz polecenie Wybierz paletę i ustaw przedziały."]
[null,null,null,null,null,null,null,null,null,null,null,null,null,null,null,"3. Kliknij OK"]
[]
[null,null,null,null,null,null,null,null,null,null,null,null,null,null,null,"Wykres bąbelkowy"]
[null,null,null,null,null,null,null,null,null,null,null,null,null,null,null,"1. Wprowadź wartości w kolumnie H arkusza Dane (możesz je skopiować z arkusza Przykład)."]
[null,null,null,null,null,null,null,null,null,null,null,null,null,null,null,"2. Wybierz polecenie Włącz/Wyłącz z grupy Bąbelkowy."]
[]
[null,null,null,null,null,null,null,null,null,null,null,null,null,null,null,"Wykres kolumnowy / kołowy"]
[null,null,null,null,null,null,null,null,null,null,null,null,null,null,null,"1. Wprowadź wartości w kolumnach J:S (możesz je skopiować z arkusza Przykład z kolumn F:H)."]
[null,null,null,null,null,null,null,null,null,null,null,null,null,null,null,"2. Wybierz polecenie Wstaw z grupy Kolumnowy lub Kołowy."]
[]
[null,null,null,null,null,null,null,null,null,null,null,null,null,null,null,"Kody pocztowe"]
[null,null,null,null,null,null,null,null,null,null,null,null,null,null,null,"1. Wybierz polecenie Wstaw z grupy kody pocztowe."]
[null,null,null,null,null,null,null,null,null,null,null,null,null,null,null,"2. Do arkusza Kody_dane wstaw dane w kolumnach A:B (możesz je skopiować z arkusza Przykładowe kody)."]
[null,null,null,null,null,null,null,null,null,null,null,null,null,null,null,"3. Wybierz polecenie Przypisz."]
[null,null,null,null,null,null,null,null,null,null,null,null,null,null,null,"4. Ustaw przedziały i wybierz rRysuj."]
{"$rows_left_out":5}
{"sheet":"Dane","index":1,"n_rows":44,"n_cols":54,"rows_kept":44,"cut":false,"hidden":false,"merged":[]}
["ID","Województwo","Powiat","Gmina","Typ","Siedziba","Wartość","Wielkość bąbelka","Kolor bąbelka","Dane 1","Dane 2","Dane 3","Dane 4","Dane 5","Dane 6","Dane 7","Dane 8","Dane 9","Dane 10","Etykiety","Widoczność kształtu","Długość","Szerokość","Nazwa","Szerokość","Wysokość","Pozycja Top","Pozycja Left","Kolory1","Kolory2","Kolory3","Kolory4","Kolory5","Kolory6","Kolory7","Kolory8","Kolory9","Kolory10",null,null,null,null,null,null,null,null,null,null,null,null,null,null,null,0]
["mazowieckie","mazowieckie",null,null,"województwo","Warszawa",null,null,null,null,null,null,null,null,null,null,null,null,null,{"$f":"B2&\": \"&G2","v":"mazowieckie: "},0,21.006250000000001,52.228748000000003]
["mazo_Warszawa","mazowieckie","Warszawa",null,"powiat","Warszawa",null,null,null,null,null,null,null,null,null,null,null,null,null,{"$f":"B3&\", \"&C3&\": \"&G3","v":"mazowieckie, Warszawa: "},1,21.006250000000001,52.228748000000003]
["mazo_Ostroleka","mazowieckie","Ostrołęka",null,"powiat","Ostrołęka",null,null,null,null,null,null,null,null,null,null,null,null,null,"mazowieckie, Ostrołęka: ",1,21.571059999999999,53.088428]
["mazo_Plock","mazowieckie","Płock",null,"powiat","Płock",null,null,null,null,null,null,null,null,null,null,null,null,null,"mazowieckie, Płock: ",1,19.706249,52.543449000000003]
["mazo_Radom","mazowieckie","Radom",null,"powiat","Radom",null,null,null,null,null,null,null,null,null,null,null,null,null,"mazowieckie, Radom: ",1,21.137969999999999,51.390510999999996]
["mazo_Siedlce","mazowieckie","Siedlce",null,"powiat","Siedlce",null,null,null,null,null,null,null,null,null,null,null,null,null,"mazowieckie, Siedlce: ",1,22.284229,52.163527999999999]
["mazo_Bialobrzegi","mazowieckie","białobrzeski",null,"powiat","Białobrzegi",null,null,null,null,null,null,null,null,null,null,null,null,null,"mazowieckie, białobrzeski: ",1,20.953291,51.645302000000001]
["mazo_Ciechanow","mazowieckie","ciechanowski",null,"powiat","Ciechanów",null,null,null,null,null,null,null,null,null,null,null,null,null,"mazowieckie, ciechanowski: ",1,20.617460000000001,52.881672000000002]
["mazo_Garwolin","mazowieckie","garwoliński",null,"powiat","Garwolin",null,null,null,null,null,null,null,null,null,null,null,null,null,"mazowieckie, garwoliński: ",1,21.610099999999999,51.902802000000001]
["mazo_Gostynin","mazowieckie","gostyniński",null,"powiat","Gostynin",null,null,null,null,null,null,null,null,null,null,null,null,null,"mazowieckie, gostyniński: ",1,19.462039999999998,52.429648999999998]
["mazo_Grodzisk_Mazowiecki","mazowieckie","grodziski",null,"powiat","Grodzisk Mazowiecki",null,null,null,null,null,null,null,null,null,null,null,null,null,"mazowieckie, grodziski: ",1,20.623118999999999,52.103949999999998]
["mazo_Grojec","mazowieckie","grójecki",null,"powiat","Grójec",null,null,null,null,null,null,null,null,null,null,null,null,null,"mazowieckie, grójecki: ",1,20.866810000000001,51.865212]
["mazo_Kozienice","mazowieckie","kozienicki",null,"powiat","Kozienice",null,null,null,null,null,null,null,null,null,null,null,null,null,"mazowieckie, kozienicki: ",1,21.543119000000001,51.586779999999997]
["mazo_Legionowo","mazowieckie","legionowski",null,"powiat","Legionowo",null,null,null,null,null,null,null,null,null,null,null,null,null,"mazowieckie, legionowski: ",1,20.93421,52.397480000000002]
["mazo_Lipsko","mazowieckie","lipski",null,"powiat","Lipsko",null,null,null,null,null,null,null,null,null,null,null,null,null,"mazowieckie, lipski: ",1,21.650700000000001,51.158099999999997]
["mazo_losice","mazowieckie","łosicki",null,"powiat","Łosice",null,null,null,null,null,null,null,null,null,null,null,null,null,"mazowieckie, łosicki: ",1,22.709530000000001,52.212710999999999]
["mazo_Makow_Mazowiecki","mazowieckie","makowski",null,"powiat","Maków Mazowiecki",null,null,null,null,null,null,null,null,null,null,null,null,null,"mazowieckie, makowski: ",1,21.086309,52.862887999999998]
["mazo_Minsk_Mazowiecki","mazowieckie","miński",null,"powiat","Mińsk Mazowiecki",null,null,null,null,null,null,null,null,null,null,null,null,null,"mazowieckie, miński: ",1,21.572289999999999,52.179240999999998]
["mazo_Mlawa","mazowieckie","mławski",null,"powiat","Mława",null,null,null,null,null,null,null,null,null,null,null,null,null,"mazowieckie, mławski: ",1,20.376639999999998,53.115231000000001]
{"$rows_left_out":25}
{"sheet":"Przykład","index":2,"n_rows":44,"n_cols":8,"rows_kept":44,"cut":false,"hidden":false,"merged":[]}
["TERYT","Województwo","Powiat","Liczba mieszkańców (2014)","Średnie miesięczne wynagrodzenie (2013)","Artykuły biurowe","Meble","Urządzenia techniczne"]
["14","mazowieckie",null,5334511,4773.41,1870,2225,2630]
["1465","mazowieckie","Warszawa",1735442,5226.05,56,86,43]
["1461","mazowieckie","Ostrołęka",52611,3912.91,41,31,26]
["1462","mazowieckie","Płock",122224,4799.33,2,84,97]
["1463","mazowieckie","Radom",217201,3523.34,19,79,93]
["1464","mazowieckie","Siedlce",76603,3533.39,50,27,35]
["1401","mazowieckie","białobrzeski",33599,3384.33,22,86,85]
["1402","mazowieckie","ciechanowski",90703,3460.07,14,51,36]
["1403","mazowieckie","garwoliński",108654,3406.49,72,23,32]
["1404","mazowieckie","gostyniński",46221,3073.49,73,71,92]
["1405","mazowieckie","grodziski",89663,3997.34,15,14,41]
["1406","mazowieckie","grójecki",98670,3646.41,27,83,20]
["1407","mazowieckie","kozienicki",61722,4445.71,30,3,97]
["1408","mazowieckie","legionowski",112226,3689.53,36,20,42]
["1409","mazowieckie","lipski",35309,3228.39,93,79,98]
["1410","mazowieckie","łosicki",31973,3058.17,18,91,71]
["1411","mazowieckie","makowski",46365,3064.46,78,99,2]
["1412","mazowieckie","miński",150889,3238.87,35,72,89]
["1413","mazowieckie","mławski",73887,2824.25,98,24,86]
{"$rows_left_out":25}
{"sheet":"Przykładowe kody","index":3,"n_rows":51,"n_cols":2,"rows_kept":51,"cut":false,"hidden":false,"merged":[]}
["Kod","Wartość"]
["06-126",59]
["00-909",73]
["01-064",19]
["04-367",59]
["04-384",60]
["01-962",74]
["02-959",53]
["03-451",49]
["02-701",11]
["01-128",45]
["04-652",26]
["05-301",52]
["04-121",13]
["00-724",89]
["03-432",73]
["04-829",69]
["02-637",31]
["00-961",35]
["01-054",56]
{"$rows_left_out":32}
{"sheet":"Dane_","index":4,"n_rows":381,"n_cols":54,"rows_kept":381,"cut":false,"hidden":true,"merged":[]}
["Województwo","Powiat","Siedziba gminy","Wartość","Wielkość bąbelka","Kolor bąbelka",null,"Przedziały",null,"Przedziały na wykresie",null,null,null,null,null,null,null,null,null,null,null,null,null,null,null,null,9,0,382838928,null,null,null,null,null,null,null,null,null,null,null,null,null,null,null,null,null,null,null,null,null,null,null,null,0]
["dolnośląskie","Wrocław","Wrocław","A",null,null,"Minimum",null,"<",{"$f":"H2","v":0},null,null,null,13395711,null,null,null,null,null,null,null,null,null,null,null,null,1,1,null,null,null,null,null,null,null,null,null,null,null,null,null,null,null,null,null,null,null,null,null,null,null,null,null,3]
["dolnośląskie","Jelenia Góra","Jelenia Góra","A",null,null,null,null,"<",0,null,null,null,null,null,null,null,null,null,null,null,null,null,null,null,null,2]
["dolnośląskie","Legnica","Legnica","A",null,null,null,null,"<",0,null,null,null,null,null,null,null,null,null,null,null,null,null,null,null,null,3]
["dolnośląskie","Wałbrzych","Wałbrzych","A",null,null,null,null,"<",0,null,null,null,null,null,null,null,null,null,null,null,null,null,null,null,null,4]
["dolnośląskie","bolesławiecki","Bolesławiec","A",null,null,null,null,"<",0,null,null,null,null,null,null,null,null,null,null,null,null,null,null,null,null,5]
["dolnośląskie","dzierżoniowski","Dzierżoniów","A",null,null,null,null,"<",0,null,null,null,null,null,null,null,null,null,null,null,null,null,null,null,null,6]
["dolnośląskie","głogowski","Głogów","A",null,null,null,null,"<",0,null,null,null,null,null,null,null,null,null,null,null,null,null,null,null,null,7]
["dolnośląskie","górowski","Góra","A",null,null,null,null,"<",0,null,null,null,null,null,null,null,null,null,null,null,null,null,null,null,null,8]
["dolnośląskie","jaworski","Jawor","A",null,null,null,null,"<",0,null,null,null,null,null,null,null,null,null,null,null,null,null,null,null,null,9]
["dolnośląskie","jeleniogórski","Jelenia Góra","A",null,null,"Maksimum",null,"<",0,null,null,null,null,null,null,null,null,null,null,null,null,null,null,null,null,10]
["dolnośląskie","kamiennogórski","Kamienna Góra","A",null,null,null,null,">=",{"$f":"H11","v":0}]
["dolnośląskie","kłodzki","Kłodzko","A"]
["dolnośląskie","legnicki","Legnica","A"]
["dolnośląskie","lubański","Lubań","A"]
["dolnośląskie","lubiński","Lubin","A"]
["dolnośląskie","lwówecki","Lwówek Śląski","A"]
["dolnośląskie","milicki","Milicz","A"]
["dolnośląskie","oleśnicki","Oleśnica","A"]
["dolnośląskie","oławski","Oława","A"]
{"$rows_left_out":362}
{"sheet":"Kody","index":5,"n_rows":1,"n_cols":6,"rows_kept":1,"cut":false,"hidden":true,"merged":[]}
["Kod","Wartość","ID","Województwo","Powiat","Gmina"]

{"sheet":"Kody_Dane","index":6,"n_rows":4801,"n_cols":7,"rows_kept":4801,"cut":false,"hidden":true,"merged":[]}
["Kod","ID_wojewodztwa","ID_powiatu","ID_gminy","Wojewodztwo","Powiat","Gmina"]
["00-001","mazowieckie","mazo_Warszawa",null,"mazowieckie","Warszawa","Warszawa"]
["00-002","mazowieckie","mazo_Warszawa",null,"mazowieckie","Warszawa","Warszawa"]
["00-003","mazowieckie","mazo_Warszawa",null,"mazowieckie","Warszawa","Warszawa"]
["00-004","mazowieckie","mazo_Warszawa",null,"mazowieckie","Warszawa","Warszawa"]
["00-005","mazowieckie","mazo_Warszawa",null,"mazowieckie","Warszawa","Warszawa"]
["00-006","mazowieckie","mazo_Warszawa",null,"mazowieckie","Warszawa","Warszawa"]
["00-007","mazowieckie","mazo_Warszawa",null,"mazowieckie","Warszawa","Warszawa"]
["00-008","mazowieckie","mazo_Warszawa",null,"mazowieckie","Warszawa","Warszawa"]
["00-009","mazowieckie","mazo_Warszawa",null,"mazowieckie","Warszawa","Warszawa"]
["00-010","mazowieckie","mazo_Warszawa",null,"mazowieckie","Warszawa","Warszawa"]
["00-011","mazowieckie","mazo_Warszawa",null,"mazowieckie","Warszawa","Warszawa"]
["00-012","mazowieckie","mazo_Warszawa",null,"mazowieckie","Warszawa","Warszawa"]
["00-013","mazowieckie","mazo_Warszawa",null,"mazowieckie","Warszawa","Warszawa"]
["00-014","mazowieckie","mazo_Warszawa",null,"mazowieckie","Warszawa","Warszawa"]
["00-015","mazowieckie","mazo_Warszawa",null,"mazowieckie","Warszawa","Warszawa"]
["00-016","mazowieckie","mazo_Warszawa",null,"mazowieckie","Warszawa","Warszawa"]
["00-017","mazowieckie","mazo_Warszawa",null,"mazowieckie","Warszawa","Warszawa"]
["00-018","mazowieckie","mazo_Warszawa",null,"mazowieckie","Warszawa","Warszawa"]
["00-019","mazowieckie","mazo_Warszawa",null,"mazowieckie","Warszawa","Warszawa"]
{"$rows_left_out":4782}
{"sheet":"GUS","index":7,"n_rows":44,"n_cols":9,"rows_kept":44,"cut":false,"hidden":true,"merged":[]}
["TERYT","Województwo","Powiat","Gmina","Typ_gminy","Liczba mieszkańców (2014)","Powierzchnia (km2) (2014)","Średnie miesięczne wynagrodzenie (2013)","Wynagrodzenie/średnia krajowa (=100) (2013)"]
["14","mazowieckie",null,null,null,5334511,35558,4773.41,123.1]
["1465","mazowieckie","Warszawa",null,null,1735442,517,5226.05,134.80000000000001]
["1461","mazowieckie","Ostrołęka",null,null,52611,29,3912.91,100.9]
["1462","mazowieckie","Płock",null,null,122224,88,4799.33,123.8]
["1463","mazowieckie","Radom",null,null,217201,112,3523.34,90.9]
["1464","mazowieckie","Siedlce",null,null,76603,32,3533.39,91.1]
["1401","mazowieckie","białobrzeski",null,null,33599,639,3384.33,87.3]
["1402","mazowieckie","ciechanowski",null,null,90703,1060,3460.07,89.2]
["1403","mazowieckie","garwoliński",null,null,108654,1285,3406.49,87.9]
["1404","mazowieckie","gostyniński",null,null,46221,615,3073.49,79.3]
["1405","mazowieckie","grodziski",null,null,89663,367,3997.34,103.1]
["1406","mazowieckie","grójecki",null,null,98670,1268,3646.41,94]
["1407","mazowieckie","kozienicki",null,null,61722,916,4445.71,114.7]
["1408","mazowieckie","legionowski",null,null,112226,390,3689.53,95.2]
["1409","mazowieckie","lipski",null,null,35309,740,3228.39,83.3]
["1410","mazowieckie","łosicki",null,null,31973,772,3058.17,78.900000000000006]
["1411","mazowieckie","makowski",null,null,46365,1065,3064.46,79]
["1412","mazowieckie","miński",null,null,150889,1164,3238.87,83.5]
["1413","mazowieckie","mławski",null,null,73887,1182,2824.25,72.8]
{"$rows_left_out":25}
{"sheet":"_MP_dane_","index":8,"n_rows":16,"n_cols":3,"rows_kept":16,"cut":false,"hidden":true,"merged":[]}
[null,"Opisy do danych używanych w programie"]
[{"$f":"MIN(Dane!H2:H4000)","v":0},"Wskaznik ostatnio używanego arkusza przy \"Wybór zakresu danych\"",0]
[{"$f":"(A6-A2)/4+A2","v":0}]
[{"$f":"A3+A3-A2","v":0}]
[{"$f":"A4+A4-A3","v":0}]
[{"$f":"MAX(Dane!H2:H4000)","v":0}]
[14.5]
[14.5]
[14.5]
[14.5]
[14.5]
[50.6]
[50.35]
[50.05]
[49.7]
[49.3]

{"sheet":"Ster","index":9,"n_rows":408,"n_cols":27,"rows_kept":408,"cut":false,"hidden":true,"merged":[]}
["Kod","Nazwa ksztaltu",null,"Przedziały","Kod RGB","Kod","Wartość",null,1,"włączona",null,7,"Tablica z danymi aplikacji",null,null,null,null,null,null,7,null,null,null,null,null,null,1000]
["s_doln_Wroclaw","doln_Wroclaw",null,{"$f":"D3-1000000","v":{"$error":"#REF!"}},{"$f":"INDEX(Paleta!$A$1:$L$90,$I$1,ROW(E2))","v":13609319},"kolor11",{"$f":"D2","v":{"$error":"#REF!"}},null,null,"wyłączona",null,{"$f":"#REF!","v":{"$error":"#REF!"}},"Kolor neutralny",16316664]
["s_doln_Jelenia_Gora","doln_Jelenia_Gora",null,{"$f":"#REF!","v":{"$error":"#REF!"}},{"$f":"INDEX(Paleta!$A$1:$L$90,$I$1,ROW(E3))","v":16250871},"kolor10",{"$f":"D3","v":{"$error":"#REF!"}},null,null,1,null,{"$f":"#REF!","v":{"$error":"#REF!"}}]
["s_doln_Legnica","doln_Legnica",null,{"$f":"#REF!","v":{"$error":"#REF!"}},{"$f":"INDEX(Paleta!$A$1:$L$90,$I$1,ROW(E4))","v":6458095},"kolor9",{"$f":"D4","v":{"$error":"#REF!"}},null,null,null,null,{"$f":"#REF!","v":{"$error":"#REF!"}}]
["s_doln_Walbrzych2","doln_Walbrzych2",null,{"$f":"#REF!","v":{"$error":"#REF!"}},{"$f":"INDEX(Paleta!$A$1:$L$90,$I$1,ROW(E5))","v":0},"kolor8",{"$error":"#REF!"},null,"Numer",0,null,{"$f":"#REF!","v":{"$error":"#REF!"}}]
["s_doln_Boleslawiec","doln_Boleslawiec",null,{"$f":"#REF!","v":{"$error":"#REF!"}},{"$f":"INDEX(Paleta!$A$1:$L$90,$I$1,ROW(E6))","v":0},"kolor7",{"$error":"#REF!"},null,"Obszar",{"$f":"IF(Numer>0,INDEX(#REF!,Numer,1),\"\")","v":{"$error":"#NAME?"}},null,{"$f":"#REF!","v":{"$error":"#REF!"}}]
["s_doln_Dzierzoniow","doln_Dzierzoniow",null,{"$f":"#REF!","v":{"$error":"#REF!"}},{"$f":"INDEX(Paleta!$A$1:$L$90,$I$1,ROW(E7))","v":0},"kolor6",{"$error":"#REF!"},null,"Format","0,00",null,{"$f":"#REF!","v":{"$error":"#REF!"}}]
["s_doln_Glogow","doln_Glogow",null,{"$f":"#REF!","v":{"$error":"#REF!"}},{"$f":"INDEX(Paleta!$A$1:$L$90,$I$1,ROW(E8))","v":0},"kolor5",{"$error":"#REF!"},null,"Wartość",{"$f":"IF(Numer>0,TEXT(INDEX(#REF!,Numer,1),Format),\"\")","v":{"$error":"#NAME?"}},null,{"$f":"#REF!","v":{"$error":"#REF!"}}]
["s_doln_Gora","doln_Gora",null,{"$f":"#REF!","v":{"$error":"#REF!"}},{"$f":"INDEX(Paleta!$A$1:$L$90,$I$1,ROW(E9))","v":0},"kolor4",{"$error":"#REF!"},null,"Numer2",41,null,{"$f":"#REF!","v":{"$error":"#REF!"}}]
["s_doln_Jawor","doln_Jawor",null,{"$f":"#REF!","v":{"$error":"#REF!"}},{"$f":"INDEX(Paleta!$A$1:$L$90,$I$1,ROW(E10))","v":0},"kolor3",{"$error":"#REF!"},null,null,null,null,{"$f":"#REF!","v":{"$error":"#REF!"}}]
["s_doln_Jelenia_Gora2","doln_Jelenia_Gora2",null,{"$f":"#REF!","v":{"$error":"#REF!"}},{"$f":"INDEX(Paleta!$A$1:$L$90,$I$1,ROW(E11))","v":0},"kolor2",{"$error":"#REF!"},null,null,null,null,{"$f":"#REF!","v":{"$error":"#REF!"}}]
["s_doln_Kamienna_Gora","doln_Kamienna_Gora",null,{"$f":"#REF!","v":{"$error":"#REF!"}},{"$f":"INDEX(Paleta!$A$1:$L$90,$I$1,ROW(E12))","v":0},"kolor1",{"$error":"#REF!"}]
["s_doln_Klodzko","doln_Klodzko"]
["s_doln_Legnica2","doln_Legnica2"]
["s_doln_Luban","doln_Luban"]
["s_doln_Lubin","doln_Lubin"]
["s_doln_Lwowek_Slaski","doln_Lwowek_Slaski"]
["s_doln_Milicz","doln_Milicz"]
["s_doln_Olesnica","doln_Olesnica"]
["s_doln_Olawa","doln_Olawa"]
{"$rows_left_out":389}
{"sheet":"Paleta","index":10,"n_rows":91,"n_cols":26,"rows_kept":91,"cut":false,"hidden":true,"merged":[]}
["czerwono-niebieska",13609319,16250871,6458095,null,null,null,null,null,null,null,null,null,3]
["czerwono-niebieska",11563269,14599570,8562164,2097354,null,null,null,null,null,null,null,null,4]
["czerwono-niebieska",11563269,14599570,16250871,8562164,2097354,null,null,null,null,null,null,null,5]
["czerwono-niebieska",11298337,13609319,15787473,13097981,6458095,2824370,null,null,null,null,null,null,6]
["czerwono-niebieska",11298337,13609319,15787473,16250871,13097981,6458095,2824370,null,null,null,null,null,7]
["czerwono-niebieska",11298337,12817219,14599570,15787473,13097981,8562164,5071062,2824370,null,null,null,null,8]
["czerwono-niebieska",11298337,12817219,14599570,15787473,16250871,13097981,8562164,5071062,2824370,null,null,null,9]
["czerwono-niebieska",6369285,11298337,12817219,14599570,15787473,13097981,8562164,5071062,2824370,2031719,null,null,10]
["czerwono-niebieska",6369285,11298337,12817219,14599570,15787473,16250871,13097981,8562164,5071062,2824370,2031719,null,11]
["czerwono-zolto-niebieska",9754009,12582911,5869052,null,null,null,null,null,null,null,null,null,3]
["czerwono-zolto-niebieska",12223275,10804651,6401789,1841623,null,null,null,null,null,null,null,null,4]
["czerwono-zolto-niebieska",12223275,10804651,12582911,6401789,1841623,null,null,null,null,null,null,null,5]
["czerwono-zolto-niebieska",12421170,9754009,10024422,9167102,5869052,5193429,null,null,null,null,null,null,6]
["czerwono-zolto-niebieska",12421170,9754009,10024422,12582911,9167102,5869052,5193429,null,null,null,null,null,7]
["czerwono-zolto-niebieska",12421170,10863206,10804651,10024422,9167102,6401789,4419060,5193429,null,null,null,null,8]
["czerwono-zolto-niebieska",12421170,10863206,10804651,10024422,12582911,9167102,6401789,4419060,5193429,null,null,null,9]
["czerwono-zolto-niebieska",10637150,12421170,10863206,10804651,10024422,9167102,6401789,4419060,5193429,4325790,null,null,10]
["czerwono-zolto-niebieska",10637150,12421170,10863206,10804651,10024422,12582911,9167102,6401789,4419060,5193429,4325790,null,11]
["czerwono-zielona",6344593,12582911,5869052,null,null,null,null,null,null,null,null,null,3]
["czerwono-zielona",4298266,7002534,6401789,1841623,null,null,null,null,null,null,null,null,4]
{"$rows_left_out":72}
{"sheet":"Przedstawiciele","index":11,"n_rows":398,"n_cols":27,"rows_kept":398,"cut":false,"hidden":true,"merged":[]}
["Nazwa","Kolor","Domyślne",null,null,null,null,null,null,null,null,null,null,null,null,null,null,null,null,null,null,null,null,null,null,null,"30"]
["Kategoria 1",1841892,1841892]
["Kategoria 2",12090935,12090935]
["Kategoria 3",4894541,4894541]
["Kategoria 4",10702488,10702488]
["Kategoria 5",32767,32767]
["Kategoria 6",3407871,3407871]
["Kategoria 7",2643622,2643622]
["Kategoria 8",12550647,12550647]
["Kategoria 9",10066329,10066329]
["Kategoria 10",14929574,14929574]
["Kategoria 11",11827231,11827231]
["Kategoria 12",9101234,9101234]
["Kategoria 13",2924595,2924595]
["Kategoria 14",10066683,10066683]
["Kategoria 15",1841891,1841891]
["Kategoria 16",7323645,7323645]
["Kategoria 17",32767,32767]
["Kategoria 18",14070474,14070474]
["Kategoria 19",10108266,10108266]
{"$rows_left_out":378}